BDBM50206112 (8S,11R,13S,14R,17S)-17-(3-chloro-phenylethynyl)-11-(4-dimethylamino-phenyl)-17-hydroxy-13-methyl-1,2,8,11,12,13,14,15,16,17-decahydro-6H-7-oxa-cyclopenta[a]phenanthren-3-one::CHEMBL245131
SMILES CN(C)c1ccc(cc1)[C@H]1C[C@@]2(C)[C@@H](CC[C@@]2(O)C#Cc2cccc(Cl)c2)[C@@H]2OCC3=CC(=O)CCC3=C12
InChI Key InChIKey=PUDQYVKZUUIVDC-ZDRBTZMISA-N
Data  2 IC50
  Tab Delimited (TSV)   2D SDfile   Computed 3D by Vconf -m prep SDfile
Find this compound or compounds like it in BindingDB:
Activity Spreadsheet -- Enzyme Inhibition Constant Data from BindingDB
Found 2 hits for monomerid = 50206112
TargetGlucocorticoid receptor(Homo sapiens (Human))
Johnson And Johnson Pharmaceutical Research And Development
Curated by ChEMBL
LigandPNGBDBM50206112((8S,11R,13S,14R,17S)-17-(3-chloro-phenylethynyl)-1...)
Affinity DataIC50:  48.9nM. Assay description: Antagonist activity at human glucocorticoid receptor assessed as inhibition of corticoid-induced transcription in human A549 cells by GRE-linked luci...
In DepthDetails ArticlePubMed
TargetProgesterone receptor(Homo sapiens (Human))
Johnson And Johnson Pharmaceutical Research And Development
Curated by ChEMBL
LigandPNGBDBM50206112((8S,11R,13S,14R,17S)-17-(3-chloro-phenylethynyl)-1...)
Affinity DataIC50:  12.5nM. Assay description: Antagonist activity at human progesterone receptor assessed as inhibition of alkaline phosphatase activity in human T47D cells
In DepthDetails ArticlePubMed