BDBM502067 3-(4,4-bis(Methoxy- methyl)cyclohexyl)-2- ((methyl(2-(methyl- amino)ethyl)amino)- methyl)-5,6-dihydro- 4H-pyrrolo[1,2-b]- pyrazol-5-ol::US11028083, Example 61
SMILES CNCCN(C)Cc1nn2CC(O)Cc2c1C1CCC(COC)(COC)CC1
InChI Key InChIKey=RBAYSCVUQGKEFR-UHFFFAOYSA-N
Data  1 IC50
  Tab Delimited (TSV)   2D SDfile   Computed 3D by Vconf -m prep SDfile
Find this compound or compounds like it in BindingDB:
Activity Spreadsheet -- Enzyme Inhibition Constant Data from BindingDB
Found 1 hit for monomerid = 502067
TargetProtein arginine N-methyltransferase 1(Homo sapiens)
Board Of Regents, The University Of Texas System
US Patent
LigandPNGBDBM502067(3-(4,4-bis(Methoxy- methyl)cyclohexyl)-2- ((methyl...)
Affinity DataIC50:  126nM. Assay description: This enzymatic assay was performed in a 384 well, white, low volume plate (PerkinElmer, Catalog 6008289) with assay buffer consisting of 50 mM Hepes ...
Ligand InfoPC cidPC sid
In DepthDetails US Patent