BDBM50206947 CHEMBL3966490
SMILES [H][C@@]12CC[C@@](O)(C#CC)[C@@]1(C)C[C@H](OCc1ccccc1)[C@]1([H])c3ccc(cc3CC[C@@]21[H])C(=O)Nc1cccnc1C
InChI Key InChIKey=SAWJZQKAGPVRMT-LUOXVKAHSA-N
Data  1 IC50
  Tab Delimited (TSV)   2D SDfile   Computed 3D by Vconf -m prep SDfile
Find this compound or compounds like it in BindingDB:
Activity Spreadsheet -- Enzyme Inhibition Constant Data from BindingDB
Found 1 hit for monomerid = 50206947
TargetGlucocorticoid receptor(Homo sapiens (Human))
The Scripps Research Institute
Curated by ChEMBL
LigandPNGBDBM50206947(CHEMBL3966490)
Affinity DataIC50:  0.400nM. Assay description: Antagonist activity at GR in human HepG2 cells assessed as inhibition of protein mediated-transcriptional activity by MMTV-promoter driven luciferase...
In DepthDetails ArticlePubMed