BDBM50207163 4-morpholin-4-yl-2-[3-(2-morpholin-4-yl-ethoxy)-phenyl]-pyrido[3',2':4,5]furo[3,2-d]pyrimidinedihydrochloride::CHEMBL538334
SMILES C(CN1CCOCC1)Oc1cccc(c1)-c1nc(N2CCOCC2)c2oc3ncccc3c2n1
InChI Key InChIKey=HXFUIPAMECNQOQ-UHFFFAOYSA-N
Data  1 IC50
  Tab Delimited (TSV)   2D SDfile   Computed 3D by Vconf -m prep SDfile
Find this compound or compounds like it in BindingDB:
Activity Spreadsheet -- Enzyme Inhibition Constant Data from BindingDB
Found 1 hit for monomerid = 50207163
LigandPNGBDBM50207163(4-morpholin-4-yl-2-[3-(2-morpholin-4-yl-ethoxy)-ph...)
Affinity DataIC50:  16nM. Assay description: Inhibition of p110alpha by SPA assay
In DepthDetails ArticlePubMed