BDBM50207168 2-(4-morpholin-4-yl-pyrido[3',2':4,5]furo[3,2-d]pyrimidin-2-yl)-phenol::CHEMBL390623
SMILES Oc1ccccc1-c1nc(N2CCOCC2)c2oc3ncccc3c2n1
InChI Key InChIKey=OWJSSUTXEPXHHS-UHFFFAOYSA-N
Data  1 IC50
  Tab Delimited (TSV)   2D SDfile   Computed 3D by Vconf -m prep SDfile
Find this compound or compounds like it in BindingDB:
Activity Spreadsheet -- Enzyme Inhibition Constant Data from BindingDB
Found 1 hit for monomerid = 50207168
LigandPNGBDBM50207168(2-(4-morpholin-4-yl-pyrido[3',2':4,5]furo[3,2-d]py...)
Affinity DataIC50:  400nM. Assay description: Inhibition of p110alpha by SPA assay
In DepthDetails ArticlePubMed