BDBM50207174 4-morpholin-4-yl-benzo[4,5]thieno[3,2-d]pyrimidine hydrochloride::CHEMBL541647
SMILES C1CN(CCO1)c1ncnc2c3ccccc3sc12
InChI Key InChIKey=LJEPZSLDJIZVIO-UHFFFAOYSA-N
Data  1 IC50
  Tab Delimited (TSV)   2D SDfile   Computed 3D by Vconf -m prep SDfile
Find this compound or compounds like it in BindingDB:
Activity Spreadsheet -- Enzyme Inhibition Constant Data from BindingDB
Found 1 hit for monomerid = 50207174
LigandPNGBDBM50207174(4-morpholin-4-yl-benzo[4,5]thieno[3,2-d]pyrimidine...)
Affinity DataIC50:  2.40E+3nM. Assay description: Inhibition of p110alpha by SPA assay
In DepthDetails ArticlePubMed