BDBM50208449 CHEMBL3883603
SMILES Cc1ccc(cc1)-n1nc(OCCCN2CCC(CC2)c2noc3cc(F)ccc23)ccc1=O
InChI Key InChIKey=OOFUYMWCXSZCMQ-UHFFFAOYSA-N
Data  3 KI
  Tab Delimited (TSV)   2D SDfile   Computed 3D by Vconf -m prep SDfile
Find this compound or compounds like it in BindingDB:
Activity Spreadsheet -- Enzyme Inhibition Constant Data from BindingDB
Found 3 hits for monomerid = 50208449
TargetD(2) dopamine receptor(Rattus norvegicus (rat))
Huazhong University Of Science And Technology
Curated by ChEMBL
LigandPNGBDBM50208449(CHEMBL3883603)
Affinity DataKi:  33nM. Assay description: Displacement of [3H]spiperone from dopamine D2 receptor in Sprague-Dawley rat striatum incubated for 30 mins by liquid scintillation counting analysi...
In DepthDetails ArticlePubMed
Target5-hydroxytryptamine receptor 1A(Rattus norvegicus (rat))
Huazhong University Of Science And Technology
Curated by ChEMBL
LigandPNGBDBM50208449(CHEMBL3883603)
Affinity DataKi:  34nM. Assay description: Displacement of [3H]8-OH-DPAT from 5-HT1A receptor in Sprague-Dawley rat cerebral cortex incubated for 30 mins by liquid scintillation counting analy...
In DepthDetails ArticlePubMed
Target5-hydroxytryptamine receptor 2A(Rattus norvegicus (rat))
Huazhong University Of Science And Technology
Curated by ChEMBL
LigandPNGBDBM50208449(CHEMBL3883603)
Affinity DataKi:  55nM. Assay description: Displacement of [3H] ketanserin from 5-HT2A receptor in Sprague-Dawley rat cerebral cortex incubated for 30 mins by liquid scintillation counting ana...
In DepthDetails ArticlePubMed