BDBM50209181 3-(3-bromophenyl)quinoline::CHEMBL397092
SMILES Brc1cccc(c1)-c1cnc2ccccc2c1
InChI Key InChIKey=IZZKXRUCFMLTKZ-UHFFFAOYSA-N
Data  1 Kd
  Tab Delimited (TSV)   2D SDfile   Computed 3D by Vconf -m prep SDfile
Find this compound or compounds like it in BindingDB:
Activity Spreadsheet -- Enzyme Inhibition Constant Data from BindingDB
Found 1 hit for monomerid = 50209181
TargetBaculoviral IAP repeat-containing protein 5(Homo sapiens (Human))
Abbott Laboratories
Curated by ChEMBL
LigandPNGBDBM50209181(3-(3-bromophenyl)quinoline | CHEMBL397092)
Affinity DataKd:  1.00E+4nM. Assay description: Binding affinity to human survivin expressed in Escherichia coli BL21 cells after 30 mins
In DepthDetails ArticlePubMed