BDBM50209182 CHEMBL234421::N-(5-chloro-3-(4-(2-chloro-5-(trifluoromethyl)phenyl)-5-cyano-6-oxo-1,6-dihydropyridin-2-yl)-2-hydroxybenzyl)-1-(cyclohexanecarbonyl)-N-methylpiperidine-4-carboxamide
SMILES CN(Cc1cc(Cl)cc(c1O)-c1cc(-c2cc(ccc2Cl)C(F)(F)F)c(C#N)c(=O)[nH]1)C(=O)C1CCN(CC1)C(=O)C1CCCCC1
InChI Key InChIKey=XYNFLQKEZVDXRD-UHFFFAOYSA-N
Data  1 Kd
  Tab Delimited (TSV)   2D SDfile   Computed 3D by Vconf -m prep SDfile
Find this compound or compounds like it in BindingDB:
Activity Spreadsheet -- Enzyme Inhibition Constant Data from BindingDB
Found 1 hit for monomerid = 50209182
TargetBaculoviral IAP repeat-containing protein 5(Homo sapiens (Human))
Abbott Laboratories
Curated by ChEMBL
LigandPNGBDBM50209182(CHEMBL234421 | N-(5-chloro-3-(4-(2-chloro-5-(trifl...)
Affinity DataKd:  100nM. Assay description: Binding affinity to human survivin expressed in Escherichia coli BL21 cells after 30 mins
In DepthDetails ArticlePubMed