BDBM50209186 1-(4-chlorophenyl)-1H-indole::CHEMBL233218
SMILES Clc1ccc(cc1)-n1ccc2ccccc12
InChI Key InChIKey=KHYIDGIPLSNPHO-UHFFFAOYSA-N
Data  1 Kd
  Tab Delimited (TSV)   2D SDfile   Computed 3D by Vconf -m prep SDfile
Find this compound or compounds like it in BindingDB:
Activity Spreadsheet -- Enzyme Inhibition Constant Data from BindingDB
Found 1 hit for monomerid = 50209186
TargetBaculoviral IAP repeat-containing protein 5(Homo sapiens (Human))
Abbott Laboratories
Curated by ChEMBL
LigandPNGBDBM50209186(1-(4-chlorophenyl)-1H-indole | CHEMBL233218)
Affinity DataKd:  5.00E+3nM. Assay description: Binding affinity to human survivin expressed in Escherichia coli BL21 cells after 30 mins
In DepthDetails ArticlePubMed