BDBM50209194 CHEMBL234358::N-(5-chloro-3-(4-(2-chloro-5-(trifluoromethyl)phenyl)-5-cyano-6-oxo-1,6-dihydropyridin-2-yl)-2-hydroxybenzyl)-N-methyl-1-propylpiperidine-4-carboxamide
SMILES CCCN1CCC(CC1)C(=O)N(C)Cc1cc(Cl)cc(c1O)-c1cc(-c2cc(ccc2Cl)C(F)(F)F)c(C#N)c(=O)[nH]1
InChI Key InChIKey=IJBUJUGLLLXHLL-UHFFFAOYSA-N
Data  2 Kd
  Tab Delimited (TSV)   2D SDfile   Computed 3D by Vconf -m prep SDfile
Find this compound or compounds like it in BindingDB:
Activity Spreadsheet -- Enzyme Inhibition Constant Data from BindingDB
Found 2 hits for monomerid = 50209194
TargetBaculoviral IAP repeat-containing protein 5(Homo sapiens (Human))
Nagasaki University
Curated by ChEMBL
LigandPNGBDBM50209194(CHEMBL234358 | N-(5-chloro-3-(4-(2-chloro-5-(trifl...)
Affinity DataKd:  44nM. Assay description: Binding affinity to recombinant full length N-terminal GST-tagged human survivin expressed in Escherichia coli BL21 incubated for 1 hr under shaking ...
In DepthDetails ArticlePubMed
TargetBaculoviral IAP repeat-containing protein 5(Homo sapiens (Human))
Nagasaki University
Curated by ChEMBL
LigandPNGBDBM50209194(CHEMBL234358 | N-(5-chloro-3-(4-(2-chloro-5-(trifl...)
Affinity DataKd:  37nM. Assay description: Binding affinity to human survivin expressed in Escherichia coli BL21 cells after 30 mins
In DepthDetails ArticlePubMed