BDBM50209557 (R)-N-((1S,2R)-2-hydroxy-2,3-dihydro-1H-inden-1-yl)-3-((2S,3S)-2-hydroxy-3-((R)-3-(methylthio)-2-(2-(3-(phenylamino)phenoxy)acetamido)propanamido)-4-phenylbutanoyl)-5,5-dimethylthiazolidine-4-carboxamide::CHEMBL266020::KNI-10061
SMILES CSC[C@H](NC(=O)COc1cccc(Nc2ccccc2)c1)C(=O)N[C@@H](Cc1ccccc1)[C@H](O)C(=O)N1CSC(C)(C)[C@H]1C(=O)N[C@@H]1[C@H](O)Cc2ccccc12
InChI Key InChIKey=KAHOVIZPKWWDDX-GCELDIMASA-N
Data  1 KI
  Tab Delimited (TSV)   2D SDfile   Computed 3D by Vconf -m prep SDfile
Find this compound or compounds like it in BindingDB:
Activity Spreadsheet -- Enzyme Inhibition Constant Data from BindingDB
Found 1 hit for monomerid = 50209557
TargetPlasmepsin II(Plasmodium falciparum)
Kyoto Pharmaceutical University
Curated by ChEMBL
LigandPNGBDBM50209557((R)-N-((1S,2R)-2-hydroxy-2,3-dihydro-1H-inden-1-yl...)
Affinity DataKi:  15nM. Assay description: Inhibition of Plasmodium falciparum plasmepsin 2
In DepthDetails ArticlePubMed