BDBM50209680 CHEMBL233622::N-(3-(5-fluoro-1H-indol-3-yl)propyl)-N-propyl-3,4-dihydro-2H-pyrano[2,3-f]quinolin-3-amine
SMILES CCCN(CCCc1c[nH]c2ccc(F)cc12)C1COc2c(C1)ccc1ncccc21
InChI Key InChIKey=PVLHJBACUBNDAT-UHFFFAOYSA-N
Data  1 KI
  Tab Delimited (TSV)   2D SDfile   Computed 3D by Vconf -m prep SDfile
Find this compound or compounds like it in BindingDB:
Activity Spreadsheet -- Enzyme Inhibition Constant Data from BindingDB
Found 1 hit for monomerid = 50209680
TargetSodium-dependent serotonin transporter(Rattus norvegicus (rat))
Wyeth Research
Curated by ChEMBL
LigandPNGBDBM50209680(CHEMBL233622 | N-(3-(5-fluoro-1H-indol-3-yl)propyl...)
Affinity DataKi:  12.4nM. Assay description: Displacement of [3H]paroxetine from 5HT reuptake site of rat cortical 5HTT
In DepthDetails ArticlePubMed