BDBM50209975 1-((3R,4R)-3-(((S)-3-(4-fluorobenzyl)piperidin-1-yl)methyl)-1-(1-methylpiperidin-4-yl)piperidin-4-yl)-3-(5-acetyl-4-methylthiazol-2-yl)urea::CHEMBL401394
SMILES CN1CCC(CC1)N1CC[C@@H](NC(=O)Nc2nc(C)c(s2)C(C)=O)[C@H](CN2CCC[C@@H](Cc3ccc(F)cc3)C2)C1
InChI Key InChIKey=IATQFPFNGNYBPW-BXTSTYNKSA-N
Data  2 IC50
  Tab Delimited (TSV)   2D SDfile   Computed 3D by Vconf -m prep SDfile
Find this compound or compounds like it in BindingDB:
Activity Spreadsheet -- Enzyme Inhibition Constant Data from BindingDB
Found 2 hits for monomerid = 50209975
TargetC-C chemokine receptor type 3(Homo sapiens (Human))
Bristol-Myers Squibb Pharmaceutical Research Institute
Curated by ChEMBL
LigandPNGBDBM50209975(1-((3R,4R)-3-(((S)-3-(4-fluorobenzyl)piperidin-1-y...)
Affinity DataIC50:  2nM. Assay description: Displacement of [125I]eotaxin from human CCR3 expressed in CHO cells after 30 mins
In DepthDetails ArticlePubMed
TargetCytochrome P450 2D6(Homo sapiens (Human))
Bristol-Myers Squibb Pharmaceutical Research Institute
Curated by ChEMBL
LigandPNGBDBM50209975(1-((3R,4R)-3-(((S)-3-(4-fluorobenzyl)piperidin-1-y...)
Affinity DataIC50: >1.00E+5nM. Assay description: Inhibition of human recombinant CYP2D6
In DepthDetails ArticlePubMed