BDBM50211445 4-(4-(1H-indol-3-yl)-5-methylpyrimidin-2-ylamino)-N-ethylpiperidine-1-carboxamide::CHEMBL245724
SMILES CCNC(=O)N1CCC(CC1)Nc1ncc(C)c(n1)-c1c[nH]c2ccccc12
InChI Key InChIKey=UGZLJUFPCPHHSW-UHFFFAOYSA-N
Data  4 IC50
  Tab Delimited (TSV)   2D SDfile   Computed 3D by Vconf -m prep SDfile
Find this compound or compounds like it in BindingDB:
Activity Spreadsheet -- Enzyme Inhibition Constant Data from BindingDB
Found 4 hits for monomerid = 50211445
TargetMitogen-activated protein kinase 9(Homo sapiens (Human))
Ucb Pharma
Curated by ChEMBL
LigandPNGBDBM50211445(4-(4-(1H-indol-3-yl)-5-methylpyrimidin-2-ylamino)-...)
Affinity DataIC50:  250nM. Assay description: Inhibition of JNK2
In DepthDetails ArticlePubMed
TargetMitogen-activated protein kinase 8(Homo sapiens (Human))
Ucb Pharma
Curated by ChEMBL
LigandPNGBDBM50211445(4-(4-(1H-indol-3-yl)-5-methylpyrimidin-2-ylamino)-...)
Affinity DataIC50:  320nM. Assay description: Inhibition of JNK1
In DepthDetails ArticlePubMed
TargetMitogen-activated protein kinase 10(Homo sapiens (Human))
Ucb Pharma
Curated by ChEMBL
LigandPNGBDBM50211445(4-(4-(1H-indol-3-yl)-5-methylpyrimidin-2-ylamino)-...)
Affinity DataIC50:  410nM. Assay description: Inhibition of JNK3
In DepthDetails ArticlePubMed
TargetTranscription factor Jun(Homo sapiens (Human))
Ucb Pharma
Curated by ChEMBL
LigandPNGBDBM50211445(4-(4-(1H-indol-3-yl)-5-methylpyrimidin-2-ylamino)-...)
Affinity DataIC50:  1.00E+4nM. Assay description: Inhibition of cJun translocation in IL1beta-stimulated A549 cells
In DepthDetails ArticlePubMed