BDBM50211791 (4-benzylpiperazin-1-yl)(2-phenyl-2,3-dihydro-1H-imidazo[1,2-b]pyrazol-7-yl)methanone::CHEMBL390200
SMILES O=C(N1CCN(Cc2ccccc2)CC1)c1cnn2CC(Nc12)c1ccccc1
InChI Key InChIKey=DJHMATLRCWOTQH-UHFFFAOYSA-N
Data  1 KI
  Tab Delimited (TSV)   2D SDfile   Computed 3D by Vconf -m prep SDfile
Find this compound or compounds like it in BindingDB:
Activity Spreadsheet -- Enzyme Inhibition Constant Data from BindingDB
Found 1 hit for monomerid = 50211791
TargetfMet-Leu-Phe receptor(Homo sapiens (Human))
Universit£
Curated by ChEMBL
LigandPNGBDBM50211791((4-benzylpiperazin-1-yl)(2-phenyl-2,3-dihydro-1H-i...)
Affinity DataKi: >1.00E+4nM. Assay description: Displacement of [3H]-fMLP from FPR in human neutrophils
In DepthDetails ArticlePubMed