BDBM502119 US11028083, Example 89a
SMILES CNCCN(C)Cc1nn2CC(F)(F)Cc2c1[C@H]1CC[C@]2(CCCC(C)(C)O2)CC1
InChI Key InChIKey=CPMNTJSIXXYOKQ-LMTLIKQPSA-N
Data  1 IC50
  Tab Delimited (TSV)   2D SDfile   Computed 3D by Vconf -m prep SDfile
Find this compound or compounds like it in BindingDB:
Activity Spreadsheet -- Enzyme Inhibition Constant Data from BindingDB
Found 1 hit for monomerid = 502119
TargetProtein arginine N-methyltransferase 1(Homo sapiens)
Board Of Regents, The University Of Texas System
US Patent
LigandPNGBDBM502119(US11028083, Example 89a)
Affinity DataIC50:  71nM. Assay description: This enzymatic assay was performed in a 384 well, white, low volume plate (PerkinElmer, Catalog 6008289) with assay buffer consisting of 50 mM Hepes ...
Ligand InfoPC cidPC sid
In DepthDetails US Patent