BDBM50212300 CHEMBL10127
SMILES COc1ccc(CCCCc2cc(OC)c(OC)c(OC)c2)cc1O
InChI Key InChIKey=LJJCASYVBZTJCR-UHFFFAOYSA-N
Data  3 IC50
  Tab Delimited (TSV)   2D SDfile   Computed 3D by Vconf -m prep SDfile
Find this compound or compounds like it in BindingDB:
Activity Spreadsheet -- Enzyme Inhibition Constant Data from BindingDB
Found 3 hits for monomerid = 50212300
LigandPNGBDBM50212300(CHEMBL10127)
Affinity DataIC50:  5.80E+3nM. Assay description: In vitro inhibition of purified bovine brain tubulin polymerisation in the absence of microtubule-associated proteins.
In DepthDetails
LigandPNGBDBM50212300(CHEMBL10127)
Affinity DataIC50:  4.40E+3nM. Assay description: Inhibition of glutamate-dependent tubulin polymerization at 30 degrees C(0.25 mM MgCl2)
In DepthDetails ArticlePubMed
LigandPNGBDBM50212300(CHEMBL10127)
Affinity DataIC50:  3.00E+4nM. Assay description: Concentration required to inhibit the extent of glutamate-dependent tubulin polymerization by 50% at 37 degrees C(1.0 mM MgCl2)
In DepthDetails ArticlePubMed