BDBM50213740 1-[2-(7-chloro-5-hydroxy-1,1-dioxo-1,4-dihydro-1lambda6-benzo[1,2,4]thiadiazin-3-ylamino)-phenyl]-ethanone::CHEMBL233973
SMILES CC(=O)c1ccccc1NC1=Nc2c(O)cc(Cl)cc2S(=O)(=O)N1
InChI Key InChIKey=CBLHBDWAZBPMGA-UHFFFAOYSA-N
Data  1 IC50
  Tab Delimited (TSV)   2D SDfile   Computed 3D by Vconf -m prep SDfile
Find this compound or compounds like it in BindingDB:
Activity Spreadsheet -- Enzyme Inhibition Constant Data from BindingDB
Found 1 hit for monomerid = 50213740
TargetC-X-C chemokine receptor type 2(Homo sapiens (Human))
Glaxosmithkline
Curated by ChEMBL
LigandPNGBDBM50213740(1-[2-(7-chloro-5-hydroxy-1,1-dioxo-1,4-dihydro-1la...)
Affinity DataIC50:  4.50E+3nM. Assay description: Antagonist activity at CXCR2 receptor expressed in CHOK1 cells assessed as human IL8-induced calcium mobilization by FLIPR
In DepthDetails ArticlePubMed