BDBM50213865 CHEMBL20725
SMILES CCCC(C)(C)C(=O)NCCN1CCN(CC1)c1ccc(Cl)cc1
InChI Key InChIKey=NDLFGMFEIAWZRU-UHFFFAOYSA-N
Data  2 KI
  Tab Delimited (TSV)   2D SDfile   Computed 3D by Vconf -m prep SDfile
Find this compound or compounds like it in BindingDB:
Activity Spreadsheet -- Enzyme Inhibition Constant Data from BindingDB
Found 2 hits for monomerid = 50213865
TargetD(4) dopamine receptor(Homo sapiens (Human))TBA
LigandPNGBDBM50213865(CHEMBL20725)
Affinity DataKi:  7.90nM. Assay description: Binding affinity at cloned human Dopamine receptor D4 expressed in HEK 293 cells, using [3H]nemonapride as radioligand
In DepthDetails
TargetD(2) dopamine receptor(Homo sapiens (Human))TBA
LigandPNGBDBM50213865(CHEMBL20725)
Affinity DataKi:  2.51E+3nM. Assay description: Binding affinity at cloned human Dopamine receptor D2 expressed in CHO cells, using [125I]iodosulpiride as radioligand
In DepthDetails