BDBM50213869 CHEMBL3037859
SMILES [H][C@@]1(OCc2ccccc2)C2CN(CCCCCCN)C[C@H](N2CCc2c[nH]c3ccccc23)[C@@]1([H])OCc1ccccc1
InChI Key InChIKey=HCLMVTFMVQFQOL-ISBWPTOWSA-N
Data  1 IC50
  Tab Delimited (TSV)   2D SDfile   Computed 3D by Vconf -m prep SDfile
Find this compound or compounds like it in BindingDB:
Activity Spreadsheet -- Enzyme Inhibition Constant Data from BindingDB
Found 1 hit for monomerid = 50213869
LigandPNGBDBM50213869(CHEMBL3037859)
Affinity DataIC50:  1.20E+4nM. Assay description: Compound was tested for its potency to displace 3-[125I]- - Tyr11-SRIF-14 from somatostatin receptor on membranes of rat cerebral cortex
In DepthDetails