BDBM502140 US11028083, Example 101b
SMILES CC[C@@]1(COCC(F)(F)F)CC[C@@H](CC1)c1c(CN(C)CCNC)nn2CCCc12
InChI Key InChIKey=PLUSDQOGGKZYQL-UEDWGHLCSA-N
Data  1 IC50
  Tab Delimited (TSV)   2D SDfile   Computed 3D by Vconf -m prep SDfile
Find this compound or compounds like it in BindingDB:
Activity Spreadsheet -- Enzyme Inhibition Constant Data from BindingDB
Found 1 hit for monomerid = 502140
TargetProtein arginine N-methyltransferase 1(Homo sapiens)
Board Of Regents, The University Of Texas System
US Patent
LigandPNGBDBM502140(US11028083, Example 101b)
Affinity DataIC50:  29nM. Assay description: This enzymatic assay was performed in a 384 well, white, low volume plate (PerkinElmer, Catalog 6008289) with assay buffer consisting of 50 mM Hepes ...
Ligand InfoPC cidPC sid
In DepthDetails US Patent