BDBM50214237 CHEMBL400947::N-(2-hydroxy-5-((S)-2-hydroxy-3-((R)-1-(3-hydroxy-4-methoxyphenyl)-2-phenylethylamino)propyl)phenyl)methanesulfonamide
SMILES COc1ccc(cc1O)[C@@H](Cc1ccccc1)NC[C@@H](O)Cc1ccc(O)c(NS(C)(=O)=O)c1
InChI Key InChIKey=BYUBXSXRLWKQOA-LEWJYISDSA-N
Data  3 KI
  Tab Delimited (TSV)   2D SDfile   Computed 3D by Vconf -m prep SDfile
Find this compound or compounds like it in BindingDB:
Activity Spreadsheet -- Enzyme Inhibition Constant Data from BindingDB
Found 3 hits for monomerid = 50214237
TargetBeta-3 adrenergic receptor(Homo sapiens (Human))
Bristol-Myers Squibb Pharmaceutical Research Institute
Curated by ChEMBL
LigandPNGBDBM50214237(CHEMBL400947 | N-(2-hydroxy-5-((S)-2-hydroxy-3-((R...)
Affinity DataKi:  8nM. Assay description: Displacement of [125I]iodocyanopindolol from cloned human adrenergic beta-3 receptor expressed in CHO cells
In DepthDetails ArticlePubMed
TargetBeta-2 adrenergic receptor(Homo sapiens (Human))
Bristol-Myers Squibb Pharmaceutical Research Institute
Curated by ChEMBL
LigandPNGBDBM50214237(CHEMBL400947 | N-(2-hydroxy-5-((S)-2-hydroxy-3-((R...)
Affinity DataKi:  1.07E+3nM. Assay description: Displacement of [125I]iodocyanopindolol from human cloned adrenergic beta-2 receptor expressed in CHO cells
In DepthDetails ArticlePubMed
TargetBeta-1 adrenergic receptor(Homo sapiens (Human))
Bristol-Myers Squibb Pharmaceutical Research Institute
Curated by ChEMBL
LigandPNGBDBM50214237(CHEMBL400947 | N-(2-hydroxy-5-((S)-2-hydroxy-3-((R...)
Affinity DataKi:  3.20E+3nM. Assay description: Displacement of [125I]iodocyanopindolol from human cloned adrenergic beta-1 receptor expressed in CHO cells
In DepthDetails ArticlePubMed