BDBM502145 US11028083, Example 104b
SMILES CCOC[C@]1(CCC(F)(F)F)CC[C@@H](CC1)c1c(CN(C)CCNC)nn2CCOCc12
InChI Key InChIKey=ZYEQZGTTZRGRSV-CXGRPWHSSA-N
Data  1 IC50
  Tab Delimited (TSV)   2D SDfile   Computed 3D by Vconf -m prep SDfile
Find this compound or compounds like it in BindingDB:
Activity Spreadsheet -- Enzyme Inhibition Constant Data from BindingDB
Found 1 hit for monomerid = 502145
TargetProtein arginine N-methyltransferase 1(Homo sapiens)
Board Of Regents, The University Of Texas System
US Patent
LigandPNGBDBM502145(US11028083, Example 104b)
Affinity DataIC50:  91nM. Assay description: This enzymatic assay was performed in a 384 well, white, low volume plate (PerkinElmer, Catalog 6008289) with assay buffer consisting of 50 mM Hepes ...
Ligand InfoPC cidPC sid
In DepthDetails US Patent