BDBM50214660 1-(2,6-dichloro-4-(trifluoromethyl)phenyl)-5-phenyl-1H-1,2,3-triazole::CHEMBL235785
SMILES FC(F)(F)c1cc(Cl)c(c(Cl)c1)-n1nncc1-c1ccccc1
InChI Key InChIKey=QMZUSVDSLQQUJW-UHFFFAOYSA-N
Data  1 KI
  Tab Delimited (TSV)   2D SDfile   Computed 3D by Vconf -m prep SDfile
Find this compound or compounds like it in BindingDB:
Activity Spreadsheet -- Enzyme Inhibition Constant Data from BindingDB
Found 1 hit for monomerid = 50214660
TargetGamma-aminobutyric acid receptor subunit alpha-2/beta-2/gamma-2(Homo sapiens (Human))
Shimane University
Curated by ChEMBL
LigandPNGBDBM50214660(1-(2,6-dichloro-4-(trifluoromethyl)phenyl)-5-pheny...)
Affinity DataKi: >9.15E+3nM. Assay description: Displacement of [3H]EBOB from human recombinant GABA alpha-1-beta-2-gamma-2 receptor expressed in HEK293 cells
In DepthDetails ArticlePubMed