BDBM50214665 1-(2,6-dibromo-4-trifluoromethylphenyl)-5-methyl-4-n-propyl-1H-1,2,3-triazole::CHEMBL396305
SMILES CCCc1nnn(c1C)-c1c(Br)cc(cc1Br)C(F)(F)F
InChI Key InChIKey=QJMNBCZNCXOESN-UHFFFAOYSA-N
Data  2 KI
  Tab Delimited (TSV)   2D SDfile   Computed 3D by Vconf -m prep SDfile
Find this compound or compounds like it in BindingDB:
Activity Spreadsheet -- Enzyme Inhibition Constant Data from BindingDB
Found 2 hits for monomerid = 50214665
TargetGamma-aminobutyric acid receptor subunit beta-3(Homo sapiens (Human))
Shimane University
Curated by ChEMBL
LigandPNGBDBM50214665(1-(2,6-dibromo-4-trifluoromethylphenyl)-5-methyl-4...)
Affinity DataKi:  14nM. Assay description: Displacement of [3H]EBOB from human recombinant GABAbeta3 receptor expressed in HEK293 cells
In DepthDetails ArticlePubMed
TargetGamma-aminobutyric acid receptor subunit alpha-2/beta-2/gamma-2(Homo sapiens (Human))
Shimane University
Curated by ChEMBL
LigandPNGBDBM50214665(1-(2,6-dibromo-4-trifluoromethylphenyl)-5-methyl-4...)
Affinity DataKi: >9.15E+3nM. Assay description: Displacement of [3H]EBOB from human recombinant GABA alpha-1-beta-2-gamma-2 receptor expressed in HEK293 cells
In DepthDetails ArticlePubMed