BDBM50215429 CHEMBL243759::N-(2-(2-amino-1H-imidazol-5-yl)ethyl)-2-(6-(3-aminophenyl)-5-chloro-3-(cyclobutylamino)-2-oxopyrazin-1(2H)-yl)acetamide
SMILES Nc1ncc(CCNC(=O)Cn2c(c(Cl)nc(NC3CCC3)c2=O)-c2cccc(N)c2)[nH]1
InChI Key InChIKey=YJGBXIXYLSGQKV-UHFFFAOYSA-N
Data  3 IC50
  Tab Delimited (TSV)   2D SDfile   Computed 3D by Vconf -m prep SDfile
Find this compound or compounds like it in BindingDB:
Activity Spreadsheet -- Enzyme Inhibition Constant Data from BindingDB
Found 3 hits for monomerid = 50215429
TargetProthrombin(Homo sapiens (Human))
Pfizer
Curated by ChEMBL
LigandPNGBDBM50215429(CHEMBL243759 | N-(2-(2-amino-1H-imidazol-5-yl)ethy...)
Affinity DataIC50: >3.00E+4nM. Assay description: Inhibition of factor 2a
In DepthDetails ArticlePubMed
TargetCoagulation factor VII(Homo sapiens (Human))
Pfizer
Curated by ChEMBL
LigandPNGBDBM50215429(CHEMBL243759 | N-(2-(2-amino-1H-imidazol-5-yl)ethy...)
Affinity DataIC50: >3.00E+4nM. Assay description: Inhibition of factor 7a
In DepthDetails ArticlePubMed
TargetCoagulation factor X(Homo sapiens (Human))
Pfizer
Curated by ChEMBL
LigandPNGBDBM50215429(CHEMBL243759 | N-(2-(2-amino-1H-imidazol-5-yl)ethy...)
Affinity DataIC50: >3.00E+4nM. Assay description: Inhibition of factor 10a
In DepthDetails ArticlePubMed