BDBM50215437 CHEMBL243109::N-((3-aminobenzo[d]isoxazol-6-yl)methyl)-2-(6-(3-aminophenyl)-5-chloro-3-(cyclobutylamino)-2-oxopyrazin-1(2H)-yl)acetamide
SMILES Nc1noc2cc(CNC(=O)Cn3c(c(Cl)nc(NC4CCC4)c3=O)-c3cccc(N)c3)ccc12
InChI Key InChIKey=YQPZEPGVMQMDQI-UHFFFAOYSA-N
Data  3 IC50
  Tab Delimited (TSV)   2D SDfile   Computed 3D by Vconf -m prep SDfile
Find this compound or compounds like it in BindingDB:
Activity Spreadsheet -- Enzyme Inhibition Constant Data from BindingDB
Found 3 hits for monomerid = 50215437
TargetCoagulation factor VII(Homo sapiens (Human))
Pfizer
Curated by ChEMBL
LigandPNGBDBM50215437(CHEMBL243109 | N-((3-aminobenzo[d]isoxazol-6-yl)me...)
Affinity DataIC50:  1.20E+4nM. Assay description: Inhibition of factor 7a
In DepthDetails ArticlePubMed
TargetProthrombin(Homo sapiens (Human))
Pfizer
Curated by ChEMBL
LigandPNGBDBM50215437(CHEMBL243109 | N-((3-aminobenzo[d]isoxazol-6-yl)me...)
Affinity DataIC50: >3.00E+4nM. Assay description: Inhibition of factor 2a
In DepthDetails ArticlePubMed
TargetCoagulation factor X(Homo sapiens (Human))
Pfizer
Curated by ChEMBL
LigandPNGBDBM50215437(CHEMBL243109 | N-((3-aminobenzo[d]isoxazol-6-yl)me...)
Affinity DataIC50: >3.00E+4nM. Assay description: Inhibition of factor 10a
In DepthDetails ArticlePubMed