BDBM50215550 CHEMBL407643
SMILES [H][C@@]1(NC(=O)[C@H](CCCCNC(=O)OC(C)(C)C)NC(=O)[C@H](Cc2c[nH]c3ccccc23)NC(=O)[C@H](Cc2ccccc2)NC(=O)[C@H](CSSC[C@@H](NC1=O)C(=O)N[C@@H]([C@@H](C)O)C(O)=O)NC(=O)[C@@H](Cc1ccccc1)NC(=O)CN1CCN(CC(O)=O)CCN(CC(O)=O)CCN(CC(O)=O)CC1)[C@@H](C)O
InChI Key InChIKey=MSCJNOQKTBNYOM-PHSXUOKHSA-N
Data  1 KI
  Tab Delimited (TSV)   2D SDfile   Computed 3D by Vconf -m prep SDfile
Find this compound or compounds like it in BindingDB:
Activity Spreadsheet -- Enzyme Inhibition Constant Data from BindingDB
Found 1 hit for monomerid = 50215550
TargetSomatostatin receptor type 2(Homo sapiens (Human))
Novartis Pharma
Curated by ChEMBL
LigandPNGBDBM50215550(CHEMBL407643)
Affinity DataKi:  3.20nM. Assay description: Binding affinity for SSTR2 receptors of rat cortex membranes was determined by using [125I][Tyr3]-octreotide radioligand
In DepthDetails ArticlePubMed