BDBM50216579 CHEMBL401024::cis-3-chloro-N-(2-(2-fluoro-4-(2-oxopyridin-1(2H)-yl)benzamido)cyclohexyl)-1H-indole-6-carboxamide
SMILES Fc1cc(ccc1C(=O)N[C@H]1CCCC[C@H]1NC(=O)c1ccc2c(Cl)c[nH]c2c1)-n1ccccc1=O
InChI Key InChIKey=LUXUICRDQDEJKF-PKTZIBPZSA-N
Data  1 KI
  Tab Delimited (TSV)   2D SDfile   Computed 3D by Vconf -m prep SDfile
Find this compound or compounds like it in BindingDB:
Activity Spreadsheet -- Enzyme Inhibition Constant Data from BindingDB
Found 1 hit for monomerid = 50216579
TargetCoagulation factor X(Homo sapiens (Human))
Bristol-Myers Squibb
Curated by ChEMBL
LigandPNGBDBM50216579(CHEMBL401024 | cis-3-chloro-N-(2-(2-fluoro-4-(2-ox...)
Affinity DataKi:  0.710nM. Assay description: Inhibition of human factor 10a
In DepthDetails ArticlePubMed