BDBM50217922 3-[(6-chloroimidazo[2,1-b][1,3]thiazol-5-yl)sulfonyl]-1-(1-ethylpiperidin-3-yl)-1H-pyrrolo[2,3-b]pyridine::CHEMBL392746
SMILES CCN1CCCC(C1)n1cc(c2cccnc12)S(=O)(=O)C1N2C=CSC2N=C1Cl
InChI Key InChIKey=DMUZERLKXQZHLM-UHFFFAOYSA-N
Data  1 KI  1 EC50
  Tab Delimited (TSV)   2D SDfile   Computed 3D by Vconf -m prep SDfile
Find this compound or compounds like it in BindingDB:
Activity Spreadsheet -- Enzyme Inhibition Constant Data from BindingDB
Found 2 hits for monomerid = 50217922
Target5-hydroxytryptamine receptor 6(Homo sapiens (Human))
Wyeth Research
Curated by ChEMBL
LigandPNGBDBM50217922(3-[(6-chloroimidazo[2,1-b][1,3]thiazol-5-yl)sulfon...)
Affinity DataKi:  0.700nM. Assay description: Displacement of [3H]LSD from cloned human 5HT6 expressed in HeLa cells
In DepthDetails ArticlePubMed
Target5-hydroxytryptamine receptor 6(Homo sapiens (Human))
Wyeth Research
Curated by ChEMBL
LigandPNGBDBM50217922(3-[(6-chloroimidazo[2,1-b][1,3]thiazol-5-yl)sulfon...)
Affinity DataEC50:  34nM. Assay description: Agonist activity at human 5HT6 expressed in HeLa cells assessed as intracellular cAMP level by radioimmunoassay
In DepthDetails ArticlePubMed