BDBM50218685 CHEMBL316839
SMILES CCCN(CCC)c1nccn2c(nc(CCC)c12)N(C)c1ccc(Cl)cc1Cl
InChI Key InChIKey=YWBPNWTZKONDAO-UHFFFAOYSA-N
Data  1 KI
  Tab Delimited (TSV)   2D SDfile   Computed 3D by Vconf -m prep SDfile
Find this compound or compounds like it in BindingDB:
Activity Spreadsheet -- Enzyme Inhibition Constant Data from BindingDB
Found 1 hit for monomerid = 50218685
TargetCorticotropin-releasing factor receptor 1/2(Rattus norvegicus (rat))
Dupont Pharmaceuticals
Curated by ChEMBL
LigandPNGBDBM50218685(CHEMBL316839)
Affinity DataKi:  623nM. Assay description: Binding affinity at corticotropin releasing hormone receptor in rat frontal cortex homogenates by [125I]Tyr-o-CRF displacement.
In DepthDetails ArticlePubMed