BDBM50218753 CHEMBL101093
SMILES CCCN(CCC)c1nccn2c(Nc3ccc(Cl)cc3Cl)nc(CCC)c12
InChI Key InChIKey=DCBJJSIOAORGBH-UHFFFAOYSA-N
Data  1 KI
  Tab Delimited (TSV)   2D SDfile   Computed 3D by Vconf -m prep SDfile
Find this compound or compounds like it in BindingDB:
Activity Spreadsheet -- Enzyme Inhibition Constant Data from BindingDB
Found 1 hit for monomerid = 50218753
TargetCorticotropin-releasing factor receptor 1/2(Rattus norvegicus (rat))
Dupont Pharmaceuticals
Curated by ChEMBL
LigandPNGBDBM50218753(CHEMBL101093)
Affinity DataKi:  492nM. Assay description: Binding affinity at corticotropin releasing hormone receptor in rat frontal cortex homogenates by [125I]Tyr-o-CRF displacement.
In DepthDetails ArticlePubMed