BDBM50218782 CHEMBL70615
SMILES COC(CN1CCC(Cc2ccccc2)CC1)Cc1ccc(O)cc1
InChI Key InChIKey=RFZWEUQLVBBRPQ-UHFFFAOYSA-N
Data  1 KI
  Tab Delimited (TSV)   2D SDfile   Computed 3D by Vconf -m prep SDfile
Find this compound or compounds like it in BindingDB:
Activity Spreadsheet -- Enzyme Inhibition Constant Data from BindingDB
Found 1 hit for monomerid = 50218782
TargetAlpha-1A/Alpha-1B/Alpha-1D adrenergic receptor(Homo sapiens (Human))
F. Hoffmann-La Roche
Curated by ChEMBL
LigandPNGBDBM50218782(CHEMBL70615)
Affinity DataKi:  305nM. Assay description: In vitro binding affinity towards Alpha-1 adrenergic receptor by displacing [3H]prazosin radioligand
In DepthDetails ArticlePubMed