BDBM50218909 2,2-diphenyl-N-(2-m-tolyl-2H-pyrazolo[3,4-c]quinolin-4-yl)acetamide::CHEMBL242851
SMILES Cc1cccc(c1)-n1cc2c(n1)c(NC(=O)C(c1ccccc1)c1ccccc1)nc1ccccc21
InChI Key InChIKey=IJNNXEYCDPZTQQ-UHFFFAOYSA-N
Data  2 KI
  Tab Delimited (TSV)   2D SDfile   Computed 3D by Vconf -m prep SDfile
Find this compound or compounds like it in BindingDB:
Activity Spreadsheet -- Enzyme Inhibition Constant Data from BindingDB
Found 2 hits for monomerid = 50218909
TargetAdenosine receptor A3(Homo sapiens (Human))
Università
Curated by ChEMBL
LigandPNGBDBM50218909(2,2-diphenyl-N-(2-m-tolyl-2H-pyrazolo[3,4-c]quinol...)
Affinity DataKi:  14nM. Assay description: Displacement of [125I]AB-MECA from human adenosine A3 receptor expressed in CHO cells
In DepthDetails ArticlePubMed
TargetAdenosine receptor A1(Homo sapiens (Human))
Università
Curated by ChEMBL
LigandPNGBDBM50218909(2,2-diphenyl-N-(2-m-tolyl-2H-pyrazolo[3,4-c]quinol...)
Affinity DataKi:  559nM. Assay description: Displacement of [3H]DPCPX from human adenosine A1 receptor expressed in CHO cells
In DepthDetails ArticlePubMed