BDBM50218926 CHEMBL242421::N-(2-m-tolyl-2H-pyrazolo[3,4-c]quinolin-4-yl)acetamide
SMILES CC(=O)Nc1nc2ccccc2c2cn(nc12)-c1cccc(C)c1
InChI Key InChIKey=IYLGSFHIUVSCPD-UHFFFAOYSA-N
Data  2 KI
  Tab Delimited (TSV)   2D SDfile   Computed 3D by Vconf -m prep SDfile
Find this compound or compounds like it in BindingDB:
Activity Spreadsheet -- Enzyme Inhibition Constant Data from BindingDB
Found 2 hits for monomerid = 50218926
TargetAdenosine receptor A3(Homo sapiens (Human))
Università
Curated by ChEMBL
LigandPNGBDBM50218926(CHEMBL242421 | N-(2-m-tolyl-2H-pyrazolo[3,4-c]quin...)
Affinity DataKi:  31nM. Assay description: Displacement of [125I]AB-MECA from human adenosine A3 receptor expressed in CHO cells
In DepthDetails ArticlePubMed
TargetAdenosine receptor A1(Homo sapiens (Human))
Università
Curated by ChEMBL
LigandPNGBDBM50218926(CHEMBL242421 | N-(2-m-tolyl-2H-pyrazolo[3,4-c]quin...)
Affinity DataKi:  203nM. Assay description: Displacement of [3H]DPCPX from human adenosine A1 receptor expressed in CHO cells
In DepthDetails ArticlePubMed