BDBM50220923 CHEMBL237790::N-(3-(1H-indol-4-yloxy)propyl)cyclohexanamine
SMILES C(CNC1CCCCC1)COc1cccc2[nH]ccc12
InChI Key InChIKey=QVATUGJQJMJAPA-UHFFFAOYSA-N
Data  1 KI
  Tab Delimited (TSV)   2D SDfile   Computed 3D by Vconf -m prep SDfile
Find this compound or compounds like it in BindingDB:
Activity Spreadsheet -- Enzyme Inhibition Constant Data from BindingDB
Found 1 hit for monomerid = 50220923
Target5-hydroxytryptamine receptor 1A(Homo sapiens (Human))
Eli Lilly
Curated by ChEMBL
LigandPNGBDBM50220923(CHEMBL237790 | N-(3-(1H-indol-4-yloxy)propyl)cyclo...)
Affinity DataKi:  78nM. Assay description: Displacement of [3H]DPAT from human 5HT1A receptor
In DepthDetails ArticlePubMed