BDBM50220924 4-(adamantan-1-ylamino)-1-(1H-indol-4-yloxy)-butan-2-ol::CHEMBL391230
SMILES OC(CCNC12CC3CC(CC(C3)C1)C2)COc1cccc2[nH]ccc12
InChI Key InChIKey=CFAIJELKYFWCTL-UHFFFAOYSA-N
Data  1 KI  1 EC50
  Tab Delimited (TSV)   2D SDfile   Computed 3D by Vconf -m prep SDfile
Find this compound or compounds like it in BindingDB:
Activity Spreadsheet -- Enzyme Inhibition Constant Data from BindingDB
Found 2 hits for monomerid = 50220924
Target5-hydroxytryptamine receptor 1A(Homo sapiens (Human))
Eli Lilly
Curated by ChEMBL
LigandPNGBDBM50220924(4-(adamantan-1-ylamino)-1-(1H-indol-4-yloxy)-butan...)
Affinity DataKi:  76nM. Assay description: Displacement of [3H]DPAT from human 5HT1A receptor
In DepthDetails ArticlePubMed
Target5-hydroxytryptamine receptor 1A(Homo sapiens (Human))
Eli Lilly
Curated by ChEMBL
LigandPNGBDBM50220924(4-(adamantan-1-ylamino)-1-(1H-indol-4-yloxy)-butan...)
Affinity DataEC50:  854nM. Assay description: Antagonist activity at human 5HT1A expressed in mouse LM(tK-) cells assessed as 5HT-stimulated [35S]GTPgammaS binding
In DepthDetails ArticlePubMed