BDBM50220933 10-((5S,7R,8R,9S,10S,13S,14S,17S)-17-hydroxy-10,13-dimethyl-3-oxo-hexadecahydro-1H-cyclopenta[a]phenanthren-7-yl)-2-(4,4,5,5,5-pentafluoropentyl)decanoic acid::CHEMBL236699
SMILES C[C@]12CC[C@H]3[C@H]([C@@H]1CC[C@@H]2O)[C@H](CCCCCCCCC(CCCC(F)(F)C(F)(F)F)C(O)=O)C[C@H]1CC(=O)CC[C@]31C
InChI Key InChIKey=MZBFKSCMIOVNQI-JQMCXUQFSA-N
Data  2 IC50
  Tab Delimited (TSV)   2D SDfile   Computed 3D by Vconf -m prep SDfile
Find this compound or compounds like it in BindingDB:
Activity Spreadsheet -- Enzyme Inhibition Constant Data from BindingDB
Found 2 hits for monomerid = 50220933
TargetAndrogen receptor(Homo sapiens (Human))
Chugai Pharmaceutical
Curated by ChEMBL
LigandPNGBDBM50220933(10-((5S,7R,8R,9S,10S,13S,14S,17S)-17-hydroxy-10,13...)
Affinity DataIC50:  410nM. Assay description: Displacement of [3H]mibolerone from human androgen receptor expressed in CHOK1 cells
In DepthDetails ArticlePubMed
TargetAndrogen receptor(Homo sapiens (Human))
Chugai Pharmaceutical
Curated by ChEMBL
LigandPNGBDBM50220933(10-((5S,7R,8R,9S,10S,13S,14S,17S)-17-hydroxy-10,13...)
Affinity DataIC50: >1.00E+4nM. Assay description: Antagonist activity at human androgen receptor expressed in HeLa cells assessed as inhibition of dihydrotestosterone induced transcriptional activity...
In DepthDetails ArticlePubMed