BDBM50221528 7-methoxy-4-((1R,2S)-2-phenylcyclopropylamino)-6-(3-(pyridin-3-yl)propoxy)quinoline-3-carbonitrile::CHEMBL248222
SMILES COc1cc2ncc(C#N)c(N[C@@H]3C[C@H]3c3ccccc3)c2cc1OCCCc1cccnc1
InChI Key InChIKey=OWLHVXVPQWFVKL-WIOPSUGQSA-N
Data  6 KI  1 IC50
  Tab Delimited (TSV)   2D SDfile   Computed 3D by Vconf -m prep SDfile
Find this compound or compounds like it in BindingDB:
Activity Spreadsheet -- Enzyme Inhibition Constant Data from BindingDB
Found 7 hits for monomerid = 50221528
TargetEpidermal growth factor receptor(Homo sapiens (Human))
Tanabe Research Laboratories Usa
Curated by ChEMBL
LigandPNGBDBM50221528(7-methoxy-4-((1R,2S)-2-phenylcyclopropylamino)-6-(...)
Affinity DataKi:  68nM. Assay description: Inhibition of human recombinant EGFR by fluorescence polarization assay
In DepthDetails ArticlePubMed
TargetVascular endothelial growth factor receptor 2(Homo sapiens (Human))
Tanabe Research Laboratories Usa
Curated by ChEMBL
LigandPNGBDBM50221528(7-methoxy-4-((1R,2S)-2-phenylcyclopropylamino)-6-(...)
Affinity DataKi:  650nM. Assay description: Inhibition of KDR
In DepthDetails ArticlePubMed
TargetVascular endothelial growth factor receptor 1(Homo sapiens (Human))
Tanabe Research Laboratories Usa
Curated by ChEMBL
LigandPNGBDBM50221528(7-methoxy-4-((1R,2S)-2-phenylcyclopropylamino)-6-(...)
Affinity DataKi:  1.71E+3nM. Assay description: Inhibition of Flt1
In DepthDetails ArticlePubMed
TargetTyrosine-protein kinase ABL1(Homo sapiens (Human))
Tanabe Research Laboratories Usa
Curated by ChEMBL
LigandPNGBDBM50221528(7-methoxy-4-((1R,2S)-2-phenylcyclopropylamino)-6-(...)
Affinity DataKi:  1.80E+3nM. Assay description: Inhibition of ABL
In DepthDetails ArticlePubMed
TargetProto-oncogene tyrosine-protein kinase Src(Homo sapiens (Human))
Tanabe Research Laboratories Usa
Curated by ChEMBL
LigandPNGBDBM50221528(7-methoxy-4-((1R,2S)-2-phenylcyclopropylamino)-6-(...)
Affinity DataKi: >1.00E+4nM. Assay description: Inhibition of SRC
In DepthDetails ArticlePubMed
TargetTyrosine-protein kinase SYK(Homo sapiens (Human))
Tanabe Research Laboratories Usa
Curated by ChEMBL
LigandPNGBDBM50221528(7-methoxy-4-((1R,2S)-2-phenylcyclopropylamino)-6-(...)
Affinity DataKi: >1.00E+4nM. Assay description: Inhibition of SYK
In DepthDetails ArticlePubMed
TargetEpidermal growth factor receptor(Homo sapiens (Human))
Tanabe Research Laboratories Usa
Curated by ChEMBL
LigandPNGBDBM50221528(7-methoxy-4-((1R,2S)-2-phenylcyclopropylamino)-6-(...)
Affinity DataIC50:  68nM. Assay description: Inhibition of human EGFR autophosphorylation in A431 cells
In DepthDetails ArticlePubMed