BDBM50221549 4-(7-(6-chloro-2-fluoro-3-hydroxyphenyl)-5-methylbenzo[e][1,2,4]triazin-3-ylamino)-N-(2-(pyrrolidin-1-yl)ethyl)benzenesulfonamide::CHEMBL250821::US8481536, 547
SMILES Cc1cc(cc2nnc(Nc3ccc(cc3)S(=O)(=O)NCCN3CCCC3)nc12)-c1c(Cl)ccc(O)c1F
InChI Key InChIKey=CSXVLYGUGWXOAL-UHFFFAOYSA-N
Data  1 KI  1 IC50
  Tab Delimited (TSV)   2D SDfile   Computed 3D by Vconf -m prep SDfile
Find this compound or compounds like it in BindingDB:
Activity Spreadsheet -- Enzyme Inhibition Constant Data from BindingDB
Found 2 hits for monomerid = 50221549
TargetTyrosine-protein kinase ABL1(Homo sapiens (Human))
Targegen
Curated by ChEMBL
LigandPNGBDBM50221549(4-(7-(6-chloro-2-fluoro-3-hydroxyphenyl)-5-methylb...)
Affinity DataKi:  1.30nM. Assay description: Inhibition of Abl
In DepthDetails ArticlePubMed
TargetProto-oncogene tyrosine-protein kinase Src(Homo sapiens (Human))
Targegen
US Patent
LigandPNGBDBM50221549(4-(7-(6-chloro-2-fluoro-3-hydroxyphenyl)-5-methylb...)
Affinity DataIC50:  0.700nMT: 2°C. Assay description: Testing of inhibition of kinases in vitro using luciferase-based assay from KinaseGlo, Promega Corp.
In DepthDetails US Patent