BDBM50222520 CHEMBL248980::N-(3-ethylphenyl)-2-(pyridin-4-ylmethylamino)nicotinamide
SMILES CCc1cccc(NC(=O)c2cccnc2NCc2ccncc2)c1
InChI Key InChIKey=VPSIZGXQXQGXAD-UHFFFAOYSA-N
Data  1 KI
  Tab Delimited (TSV)   2D SDfile   Computed 3D by Vconf -m prep SDfile
Find this compound or compounds like it in BindingDB:
Activity Spreadsheet -- Enzyme Inhibition Constant Data from BindingDB
Found 1 hit for monomerid = 50222520
TargetVascular endothelial growth factor receptor 2(Homo sapiens (Human))
Amgen
Curated by ChEMBL
LigandPNGBDBM50222520(CHEMBL248980 | N-(3-ethylphenyl)-2-(pyridin-4-ylme...)
Affinity DataKi:  106nM. Assay description: Inhibition of phosphorylated-Kdr after 30 mins
In DepthDetails ArticlePubMed