BDBM50222744 (2R,3R,4S,5R)-2-(6-(4-nitrobenzylthio)-2-amino-9H-purin-9-yl)-5-(hydroxymethyl)-tetrahydrofuran-3,4-diol::2-amino-6-(4-nitrobenzylthio)-9-beta-D-ribofuranosyl purine::CHEMBL394171
SMILES Nc1nc(SCc2ccc(cc2)[N+]([O-])=O)c2ncn([C@@H]3O[C@H](CO)[C@@H](O)[C@H]3O)c2n1
InChI Key InChIKey=BRSNNJIJEZWSBU-XNIJJKJLSA-N
Data  1 KI  1 IC50
  Tab Delimited (TSV)   2D SDfile   Computed 3D by Vconf -m prep SDfile
Find this compound or compounds like it in BindingDB:
Activity Spreadsheet -- Enzyme Inhibition Constant Data from BindingDB
Found 2 hits for monomerid = 50222744
TargetEquilibrative nucleoside transporter 1(Homo sapiens (Human))
University Of Tennessee Health Sciences Center
Curated by ChEMBL
LigandPNGBDBM50222744((2R,3R,4S,5R)-2-(6-(4-nitrobenzylthio)-2-amino-9H-...)
Affinity DataKi:  1.10nM. Assay description: Displacement of SAENTA-fluorescein from human ENT1 in K562 cells after 45 mins by flow cytometry
In DepthDetails ArticlePubMed
TargetEquilibrative nucleoside transporter 1(Homo sapiens (Human))
University Of Tennessee Health Sciences Center
Curated by ChEMBL
LigandPNGBDBM50222744((2R,3R,4S,5R)-2-(6-(4-nitrobenzylthio)-2-amino-9H-...)
Affinity DataIC50:  21.4nM. Assay description: Binding affinity to ENT1 transporter
In DepthDetails ArticlePubMed