BDBM50222926 CHEMBL17764
SMILES FC(F)(F)Cn1ncnc1-c1ccccc1NCC1=NCCN1
InChI Key InChIKey=WPXZJENXASTONP-UHFFFAOYSA-N
Data  3 EC50
  Tab Delimited (TSV)   2D SDfile   Computed 3D by Vconf -m prep SDfile
Find this compound or compounds like it in BindingDB:
Activity Spreadsheet -- Enzyme Inhibition Constant Data from BindingDB
Found 3 hits for monomerid = 50222926
TargetAlpha-1D adrenergic receptor(Homo sapiens (Human))
Glaxosmithkline
Curated by ChEMBL
LigandPNGBDBM50222926(CHEMBL17764)
Affinity DataEC50: <1.00E+5nM. Assay description: Agonism of recombinant human alpha-1D adrenergic receptor, expressed in rat 1 fibroblast cells
In DepthDetails ArticlePubMed
TargetAlpha-1A adrenergic receptor(Homo sapiens (Human))
Glaxosmithkline
Curated by ChEMBL
LigandPNGBDBM50222926(CHEMBL17764)
Affinity DataEC50:  79nM. Assay description: Agonism of human alpha-1A adrenergic receptor expressed in rat 1 fibroblast cells
In DepthDetails ArticlePubMed
TargetAlpha-1B adrenergic receptor(Homo sapiens (Human))
Glaxosmithkline
Curated by ChEMBL
LigandPNGBDBM50222926(CHEMBL17764)
Affinity DataEC50: <1.00E+5nM. Assay description: Agonism of human alpha-1B adrenergic receptor, expressed in rat 1 fibroblast cells
In DepthDetails ArticlePubMed