BDBM50223230 (3R,8R,9S,10S,13S,14S,17S)-3,13-dimethyl-10-vinyl-2,3,4,7,8,9,10,11,12,13,14,15,16,17-tetradecahydro-1H-cyclopenta[a]phenanthrene-3,17-diol::CHEMBL251515
SMILES C[C@]12CC[C@H]3[C@@H](CC=C4C[C@](C)(O)CC[C@]34C=C)[C@@H]1CC[C@@H]2O
InChI Key InChIKey=ZHJRJDWXSJEGFJ-YUDLKVPISA-N
Data  3 IC50  2 EC50
  Tab Delimited (TSV)   2D SDfile   Computed 3D by Vconf -m prep SDfile
Find this compound or compounds like it in BindingDB:
Activity Spreadsheet -- Enzyme Inhibition Constant Data from BindingDB
Found 5 hits for monomerid = 50223230
TargetEstrogen receptor(Homo sapiens (Human))
Merck Research Laboratories
Curated by ChEMBL
LigandPNGBDBM50223230((3R,8R,9S,10S,13S,14S,17S)-3,13-dimethyl-10-vinyl-...)
Affinity DataEC50: >1.00E+3nM. Assay description: Agonist activity at ERalpha expressed in HEK293 cells by transactivation assay
In DepthDetails ArticlePubMed
TargetEstrogen receptor beta(Homo sapiens (Human))
Merck Research Laboratories
Curated by ChEMBL
LigandPNGBDBM50223230((3R,8R,9S,10S,13S,14S,17S)-3,13-dimethyl-10-vinyl-...)
Affinity DataIC50:  2.49E+3nM. Assay description: Binding affinity at human recombinant ERbeta
In DepthDetails ArticlePubMed
TargetAndrogen receptor(Homo sapiens (Human))
Merck Research Laboratories
Curated by ChEMBL
LigandPNGBDBM50223230((3R,8R,9S,10S,13S,14S,17S)-3,13-dimethyl-10-vinyl-...)
Affinity DataIC50:  2.61E+3nM. Assay description: Binding affinity at AR
In DepthDetails ArticlePubMed
TargetEstrogen receptor(Homo sapiens (Human))
Merck Research Laboratories
Curated by ChEMBL
LigandPNGBDBM50223230((3R,8R,9S,10S,13S,14S,17S)-3,13-dimethyl-10-vinyl-...)
Affinity DataIC50: >1.00E+4nM. Assay description: Binding affinity at human recombinant ERalpha
In DepthDetails ArticlePubMed
TargetEstrogen receptor beta(Homo sapiens (Human))
Merck Research Laboratories
Curated by ChEMBL
LigandPNGBDBM50223230((3R,8R,9S,10S,13S,14S,17S)-3,13-dimethyl-10-vinyl-...)
Affinity DataEC50: >1.00E+3nM. Assay description: Agonist activity at ERbeta expressed in HEK293 cells by transactivation assay
In DepthDetails ArticlePubMed