BDBM50223732 CHEMBL118626
SMILES CCCC(CCC)c1nc(c[nH]1)-c1ccc(cc1)-c1ccc(Br)cc1
InChI Key InChIKey=GLCMZKROMMUOKM-UHFFFAOYSA-N
Data  1 IC50
  Tab Delimited (TSV)   2D SDfile   Computed 3D by Vconf -m prep SDfile
Find this compound or compounds like it in BindingDB:
Activity Spreadsheet -- Enzyme Inhibition Constant Data from BindingDB
Found 1 hit for monomerid = 50223732
TargetSodium channel protein type 1/2/3 subunit alpha(Rattus norvegicus)
Institut Henri Beaufour
Curated by ChEMBL
LigandPNGBDBM50223732(CHEMBL118626)
Affinity DataIC50:  322nM. Assay description: Concentration required to inhibit [3H]BTX binding to Sodium channel of rat brain
In DepthDetails ArticlePubMed