BDBM50223888 (S)-3-[3'-(4,5-dihydro-1H-imidazol-2-ylamino)-biphenyl-4-yl]-2-(2,4,6-trimethyl-benzenesulfonylamino)-propionic acid::CHEMBL249784
SMILES [#6]-c1cc(-[#6])c(c(-[#6])c1)S(=O)(=O)[#7]-[#6@@H](-[#6]-c1ccc(cc1)-c1cccc(c1)\[#7]=[#6]-1\[#7]-[#6]-[#6]-[#7]-1)-[#6](-[#8])=O
InChI Key InChIKey=MHGHYXQIIPLSCN-DEOSSOPVSA-N
Data  1 KI
  Tab Delimited (TSV)   2D SDfile   Computed 3D by Vconf -m prep SDfile
Find this compound or compounds like it in BindingDB:
Activity Spreadsheet -- Enzyme Inhibition Constant Data from BindingDB
Found 1 hit for monomerid = 50223888
TargetIntegrin alpha-V/beta-3(Homo sapiens (Human))
Bayer Healthcare
Curated by ChEMBL
LigandPNGBDBM50223888((S)-3-[3'-(4,5-dihydro-1H-imidazol-2-ylamino)-biph...)
Affinity DataKi:  1.30nM. Assay description: Binding affinity to integrin alphavbeta3 receptor
In DepthDetails ArticlePubMed