BDBM50224285 AHR-5850D::Amfenac Sodium::CHEBI:75918
SMILES [Na+].Nc1c(CC([O-])=O)cccc1C(=O)c1ccccc1
InChI Key InChIKey=SOYCMDCMZDHQFP-UHFFFAOYSA-M
Data  3 IC50
  Tab Delimited (TSV)   2D SDfile   Computed 3D by Vconf -m prep SDfile
Find this compound or compounds like it in BindingDB:
Activity Spreadsheet -- Enzyme Inhibition Constant Data from BindingDB
Found 3 hits for monomerid = 50224285
TargetProstaglandin G/H synthase 1/2(Bos taurus)
TBA
Curated by ChEMBL
LigandPNGBDBM50224285(AHR-5850D | Amfenac Sodium | CHEBI:75918)
Affinity DataIC50:  200nM. Assay description: Inhibition of H-Ras-mediated farnesylation expressed in mouse NIH3T3 cells
In DepthDetails ArticlePubMed
TargetProstaglandin G/H synthase 1/2(RAT)
A.H. Robins
Curated by ChEMBL
LigandPNGBDBM50224285(AHR-5850D | Amfenac Sodium | CHEBI:75918)
Affinity DataIC50:  100nM. Assay description: Inhibitory activity against Prostaglandin G/H synthase
In DepthDetails ArticlePubMed
TargetProstaglandin G/H synthase 1/2(Bos taurus)
TBA
Curated by ChEMBL
LigandPNGBDBM50224285(AHR-5850D | Amfenac Sodium | CHEBI:75918)
Affinity DataIC50:  200nM. Assay description: Inhibition of prostaglandin G/H synthase obtained from bovine seminal vesicles.
In DepthDetails ArticlePubMed