BDBM50226158 2,2-Dimethyl-Propionamide::Pivalamide
SMILES CC(C)(C)C(N)=O
InChI Key InChIKey=XIPFMBOWZXULIA-UHFFFAOYSA-N
Data  1 KI
PDB links: 2 PDB IDs match this monomer.
  Tab Delimited (TSV)   2D SDfile   Computed 3D by Vconf -m prep SDfile
Find this compound or compounds like it in BindingDB:
Activity Spreadsheet -- Enzyme Inhibition Constant Data from BindingDB
Found 1 hit for monomerid = 50226158
TargetAlcohol dehydrogenase S chain(Equus caballus)
TBA
Curated by ChEMBL
LigandPNGBDBM50226158(2,2-Dimethyl-Propionamide | Pivalamide)
Affinity DataKi:  3.47E+6nM. Assay description: Inhibitory activity against horse liver alcohol dehydrogenase (ADH)
In DepthDetails ArticlePubMed