BDBM50226193 Acrylamide::CHEBI:28619
SMILES NC(=O)C=C
InChI Key InChIKey=HRPVXLWXLXDGHG-UHFFFAOYSA-N
Data  1 KI  2 IC50
PDB links: 3 PDB IDs match this monomer.
  Tab Delimited (TSV)   2D SDfile   Computed 3D by Vconf -m prep SDfile
Find this compound or compounds like it in BindingDB:
Activity Spreadsheet -- Enzyme Inhibition Constant Data from BindingDB
Found 3 hits for monomerid = 50226193
TargetAlcohol dehydrogenase S chain(Equus caballus)
TBA
Curated by ChEMBL
LigandPNGBDBM50226193(Acrylamide | CHEBI:28619)
Affinity DataKi:  7.76E+6nM. Assay description: Inhibitory activity against horse liver alcohol dehydrogenase (ADH)
In DepthDetails ArticlePubMed
TargetSodium-dependent dopamine transporter(Rattus norvegicus (rat))
University Of Pittsburgh
Curated by ChEMBL
LigandPNGBDBM50226193(Acrylamide | CHEBI:28619)
Affinity DataIC50:  4.38E+8nM. Assay description: Inhibition of [3H]dopamine uptake at DAT in rat brain striatal synaptosomes by liquid scintillation counting analysis
In DepthDetails ArticlePubMed
TargetFibroblast growth factor receptor 4(Homo sapiens (Human))
The First Affiliated Hospital Of Zhengzhou University
Curated by ChEMBL
LigandPNGBDBM50226193(Acrylamide | CHEBI:28619)
Affinity DataIC50:  938nM. Assay description: Inhibition of human N-terminal GST-tagged FGFR4 cytoplasmic domain (460 to 802 end residues) expressed in baculovirus expression system using CSKtide...
In DepthDetails ArticlePubMed